Clipshare error failed find flength file jobs

筛选

我最近的搜索
筛选:
预算
项技能
语言
    工作状态
    2,157 clipshare error failed find flength file 找到的工作,价格在 HKD

    You can see the error here: [login to view URL] Site uses Yii, PHP and Mysql

    $188 (Avg Bid)
    $188 \u5e73\u5747\u62a5\u4ef7
    14 竞标
    Web development 已经结束 left

    I need some changes to an existing website. i want to change multiupload option on clipshare script.

    $196 (Avg Bid)
    $196 \u5e73\u5747\u62a5\u4ef7
    18 竞标

    import via plesk Job for [login to view URL] failed because the control process exited with error code. See "systemctl status [login to view URL]" and "journalctl -xe" for details. Unable to import the database_new dump: ERROR 1062 (23000) at line 12478: Duplicate entry 'i breeze 500 [0,127970,129113] -> [N] POST [login to view URL]' for key &...

    $408 (Avg Bid)
    $408 \u5e73\u5747\u62a5\u4ef7
    15 竞标

    import via plesk Job for [login to view URL] failed because the control process exited with error code. See "systemctl status [login to view URL]" and "journalctl -xe" for details. Unable to import the database_new dump: ERROR 1062 (23000) at line 12478: Duplicate entry 'i breeze 500 [0,127970,129113] -> [N] POST [login to view URL]' for key &...

    $235 (Avg Bid)
    $235 \u5e73\u5747\u62a5\u4ef7
    4 竞标

    [login to view URL] is getting a "secure connection failed" error for some browsers: see: [login to view URL]://[login to view URL] I need help to fix this issue.

    $777 (Avg Bid)
    $777 \u5e73\u5747\u62a5\u4ef7
    42 竞标

    Only need fixe for gradle 4.4 synchronization . and build apps complete show on ui . just fixed it . if you are experience on it it just less than 20 mins . thank you

    $157 / hr (Avg Bid)
    $157 / hr \u5e73\u5747\u62a5\u4ef7
    11 竞标

    Hey! Can someone help me with this error? I am not able to start my react-native app. Android studio shows this error: "Failed to resolve: react-native" If I start the react-native app with the console, the error "Execution failed for task ':app:processDebugResources'." appears.

    $46 / hr (Avg Bid)
    $46 / hr \u5e73\u5747\u62a5\u4ef7
    21 竞标

    Error: /project/gradlew: Command failed with exit code 1 Error output: FAILURE: Build failed with an exception. A problem occurred configuring root project 'project'. Here is the exact error: Could not find [login to view URL] ([login to view URL]:play-services-auth-base-license:11.8.0). Searched in the following locations with

    $126 / hr (Avg Bid)
    $126 / hr \u5e73\u5747\u62a5\u4ef7
    5 竞标

    fix failed disk in FreeNas . .. freenas error down

    $3634 (Avg Bid)
    $3634 \u5e73\u5747\u62a5\u4ef7
    17 竞标

    I need someone to configure my email server. It must be very simple but I do not know how to do it. Currently I get this error "550-No Such User Here 550 Sender verify failed" When I send an email from my server to hotmail, it bounces me; when I send to another domain I also reboot it, and gmail receives it but fails to identify the sender. And from

    $204 (Avg Bid)
    $204 \u5e73\u5747\u62a5\u4ef7
    9 竞标

    here's the error - I need you to fox this. I would but I do not have time - this is no more than 1 hour - do not bid if you think it will take more time because if you do you're unqualified to do the work. What would you like to do? ------------------------------------------------------------------------------- 1: Attempt to reinstall this existing

    $204 (Avg Bid)
    $204 \u5e73\u5747\u62a5\u4ef7
    6 竞标

    I have attached a detail document here. It's a simple game work. I worked this with an indian team. But they were full of cheaters. He took my money and gave so bad works. I dont' want to fail again. He still not feeling about their fault at all. So I want you guys to make a bad review on their company first. Then I will be able to discuss with you project. Don't regard my price her...

    $8430 (Avg Bid)
    $8430 \u5e73\u5747\u62a5\u4ef7
    27 竞标

    ...position, please take a test (video link) I included here so that we can know your ability. The video is 63 seconds long, and please transcribe in clean verbatim and save as a text file(No need to mark the speakers). Thank you! It will be much appreciated if you can tell us how much you charge to transcribe a one hour long audio. We are looking for individual

    $204 (Avg Bid)
    $204 \u5e73\u5747\u62a5\u4ef7
    8 竞标

    ...an example and also the test in the file section below. Our rates are strictly 8-12$ per 1000 words. Please send your saved test results in the format eg. moffat_12$_freelancer. Meaning name_your rate in USD_platform. Kindly bid if you are serious, find the attached test do it and send. Start with the word "find my test" in your proposal so that I will

    $86 / hr (Avg Bid)
    $86 / hr \u5e73\u5747\u62a5\u4ef7
    21 竞标

    After noting that divorce rate in America is almost 40% i decided to write a kindle book and publish it on Amazon. I am a third year psychology student so I have some advice to add to this book and I also have specific books to cite ( e.g evolutionary psychology)

    $377 (Avg Bid)
    $377 \u5e73\u5747\u62a5\u4ef7
    14 竞标
    joomla update failed 已经结束 left
    已验证

    Hi I have tried to upgrade my joomla to current version unfortunatelly it has failed. I need someone to repair and update to lates joomla version.

    $212 (Avg Bid)
    $212 \u5e73\u5747\u62a5\u4ef7
    20 竞标

    After the installation of the SSL Certificate I'm receiving an error: SSL operation failed with code 1. OpenSSL Error messages:nerror:14090086:SSL routines:SSL3_GET_SERVER_CERTIFICATE:certificate verify failed in and I need to sort it out. I have tried different options to solve it myself but it's still not working. The website's SSL is working

    $489 (Avg Bid)
    $489 \u5e73\u5747\u62a5\u4ef7
    29 竞标

    I'm working on a test case where I'm trying to test async action creator for a failed response. But the error is a promise and when the unit test is running the error promise is not resolving and the test is failing. eg: // [login to view URL] export const fetchData = () => { return (dispatch) => { return fetchJSON(URL).then((data) => ...

    $78 - $235
    $78 - $235
    0 竞标

    fix asap issue with our email not delivered "550 Reverse DNS lookup failed for IP...."

    $173 (Avg Bid)
    $173 \u5e73\u5747\u62a5\u4ef7
    16 竞标

    ...position, please take a test (video link) I included here so that we can know your ability. The video is 63 seconds long, and please transcribe in clean verbatim and save as a text file(No need to mark the speakers). Thank you! (We only require accuracy of 93% and above It will be much appreciated if you can tell us how much you charge to transcribe a one

    $157 / hr (Avg Bid)
    加精
    $157 / hr \u5e73\u5747\u62a5\u4ef7
    10 竞标

    just comment me 55 if you understant what i want. im geting 'failed to open stream: No such file or directory' error when i use copy(); it will take 1 min for solwe ofcouse if you know. i think its php 7.2 problem its working in old versions. source file is in attach. required: file will work on my host.

    $173 (Avg Bid)
    $173 \u5e73\u5747\u62a5\u4ef7
    24 竞标

    ...teamviewer or anydesktop . check: [login to view URL] chech attached photos. trasncript error shwon: 401. That’s an error. Error: invalid_client The OAuth client was not found. Request Details client_id=[login to view URL]

    $94 / hr (Avg Bid)
    $94 / hr \u5e73\u5747\u62a5\u4ef7
    23 竞标

    I need you to develop some software for me. I would like this software to be developed using PHP.

    $177 (Avg Bid)
    $177 \u5e73\u5747\u62a5\u4ef7
    1 竞标

    Fix server issues. We are using vultr and since few hours it’s been giving a httpd failed error. Will need someone who is familiar with management of servers to fix this asap. Thanks!

    $275 (Avg Bid)
    $275 \u5e73\u5747\u62a5\u4ef7
    17 竞标

    I try to build an app from source there is very popular. However in the building process its fail on one command. I searched on internet to find solutions. There is some, but i can't figure out to solved it. Need and meteor framework expert. The App Dependencies: NodeJS, Meteor, Yarn, Electron, Gulp

    $165 (Avg Bid)
    $165 \u5e73\u5747\u62a5\u4ef7
    3 竞标

    Hi, I am working with google player services in unity3d 2017.3.1f1 on mac, whenever I import the package I got few errors, I am good in unity but not in Android native, so please bid only if you are an expert in Unity+Android, please start your bid with I can fix it on teamviewer , Before bidding you should look into the files carefully and let me know who can do it.

    $204 (Avg Bid)
    $204 \u5e73\u5747\u62a5\u4ef7
    3 竞标

    ...would like this software to be developed for Windows using SQL. Need you to go through my SQL server 2008 install log and tell me why it won't instal, I get 2 error messages the first being failed to setup data base and the second being instance does not exist. Need this problem solved asap. Extra details are I'm trying to install M.U.T software and this

    $196 (Avg Bid)
    $196 \u5e73\u5747\u62a5\u4ef7
    3 竞标

    ...ONLY. HI we are receiving error (32)Broken pipe: mod_fcgid: ap_pass_brigade failed in handle_request_ipc function our sql server is going mental with load. we have tried all the methods on google but nothing worked. need your help now. we are running apache, linux with centos and php version 5.7 the error is only on one website. so that

    $212 (Avg Bid)
    $212 \u5e73\u5747\u62a5\u4ef7
    6 竞标

    ...you can use to approximate the location. Deliverable: - For each address which is a simple mispelling, provide a mapping of wrong address to corrected address (in a .txt file) - For all other addresses, provide a shapefile which defines the address locations AND a streets layer which defines any missing streets. Existing streets from OSM layer must

    $1374 (Avg Bid)
    $1374 \u5e73\u5747\u62a5\u4ef7
    19 竞标

    I need a php developer who can provide a very fast service on bug fixing at Ajax call. I have a fixed budget of around 25 USD, but if there is a guy who can do this in 5 minutes, will pay him bonus for sure. Write "I am a super php developer" on your proposal, else your bid will be hidden or removed.

    $188 (Avg Bid)
    $188 \u5e73\u5747\u62a5\u4ef7
    30 竞标
    Web development 已经结束 left

    I need an existing website rebuilt. I need you to design and build it. The basis is on licensed script clipshare , and i would like to create a copy of website "[login to view URL]" but with non adult content , just as video sharing platform and sVOD service inside.

    $26906 (Avg Bid)
    $26906 \u5e73\u5747\u62a5\u4ef7
    88 竞标

    Hello there, I am running a website with high traffic, I've installed Varnish becouse of website speed, when it reaches 2,300 online, it gives me 503 (Backend fetch failed) Varnish cache error. Maybe there is Varnish installed incorrectly, or there is a script problam wich burns the server. I also had atack from China/Russia Ip's but I've blocked them

    $1052 (Avg Bid)
    $1052 \u5e73\u5747\u62a5\u4ef7
    13 竞标

    Solve this issue: [login to view URL]

    $290 / hr (Avg Bid)
    $290 / hr \u5e73\u5747\u62a5\u4ef7
    7 竞标

    my server use cenos and suddenly its mysql server/services has failed and we need it back to work asap. pls bid only if you have the previous experience regarding this work.

    $522 (Avg Bid)
    $522 \u5e73\u5747\u62a5\u4ef7
    24 竞标

    ...from 12.5 to 17.5 and now our mail client round cube is not working properly. when trying to attach a file it does not attach and corrupts the file. also when trying to send email it gives this error SMTP Error (250): Authentication failed. we need this sorted urgently right now, also you have to work via teamviewer as we can not share our

    $204 (Avg Bid)
    $204 \u5e73\u5747\u62a5\u4ef7
    4 竞标

    When customers use Our Payment Platform and the transaction fails, an order is still genera... theres a fix for this here [login to view URL] and [login to view URL] and Regards

    $290 (Avg Bid)
    $290 \u5e73\u5747\u62a5\u4ef7
    21 竞标

    To recover the data from the RAID-5 array.

    $1185 (Avg Bid)
    $1185 \u5e73\u5747\u62a5\u4ef7
    3 竞标

    ...get the following error when I try to run my project. You will ned log to my computer using TeamViewer and fix remotely. I had a problem with ExpendableLabel framework and removed it from the search path but I may have caused another problem Error i get : ld: framework not found -framework clang: error: linker command failed with exit code 1

    $283 (Avg Bid)
    $283 \u5e73\u5747\u62a5\u4ef7
    9 竞标

    Plesk update failed / Restore of Plesk, no files on server or databses to be affected by the restore of plesk.

    $1006 (Avg Bid)
    $1006 \u5e73\u5747\u62a5\u4ef7
    18 竞标

    ...page, and you will see the fish in your cart. Error that is showing in inspector is: Uncaught DOMException: Failed to set the 'domain' property on 'Document': '[login to view URL]' is not a suffix of '[login to view URL]'. at [login to view URL]:1237:49 This error only happens when I select the domain remysreef

    $63 / hr (Avg Bid)
    $63 / hr \u5e73\u5747\u62a5\u4ef7
    9 竞标

    ...page, and you will see the fish in your cart. Error that is showing in inspector is: Uncaught DOMException: Failed to set the 'domain' property on 'Document': '[login to view URL]' is not a suffix of '[login to view URL]'. at [login to view URL]:1237:49 This error only happens when I select the domain remysreef

    $63 / hr (Avg Bid)
    $63 / hr \u5e73\u5747\u62a5\u4ef7
    17 竞标

    ...page, and you will see the fish in your cart. Error that is showing in inspector is: Uncaught DOMException: Failed to set the 'domain' property on 'Document': '[login to view URL]' is not a suffix of '[login to view URL]'. at [login to view URL]:1237:49 This error only happens when I select the domain remysreef

    $71 / hr (Avg Bid)
    $71 / hr \u5e73\u5747\u62a5\u4ef7
    10 竞标

    ...page, and you will see the fish in your cart. Error that is showing in inspector is: Uncaught DOMException: Failed to set the 'domain' property on 'Document': '[login to view URL]' is not a suffix of '[login to view URL]'. at [login to view URL]:1237:49 This error only happens when I select the domain remysreef

    $55 / hr (Avg Bid)
    $55 / hr \u5e73\u5747\u62a5\u4ef7
    6 竞标

    ...subcat=Doorbusters And try to add 1 fish to cart. You will see the fish doesn't add, BUT then reload page, and you will see the fish in your cart. Error that is happening is: Uncaught DOMException: Failed to set the 'domain' property on 'Document': '[login to view URL]' is not a suffix of '[login to view URL]'. at [login to view U...

    $71 / hr (Avg Bid)
    $71 / hr \u5e73\u5747\u62a5\u4ef7
    6 竞标

    ...subcat=Doorbusters And try to add 1 fish to cart. You will see the fish doesn't add, BUT then reload page, and you will see the fish in your cart. Error that is happening is: Uncaught DOMException: Failed to set the 'domain' property on 'Document': '[login to view URL]' is not a suffix of '[login to view URL]'. at [login to view U...

    $63 / hr (Avg Bid)
    $63 / hr \u5e73\u5747\u62a5\u4ef7
    6 竞标

    ...subcat=Doorbusters And try to add 1 fish to cart. You will see the fish doesn't add, BUT then reload page, and you will see the fish in your cart. Error that is happening is: Uncaught DOMException: Failed to set the 'domain' property on 'Document': '[login to view URL]' is not a suffix of '[login to view URL]'. at [login to view U...

    $71 / hr (Avg Bid)
    $71 / hr \u5e73\u5747\u62a5\u4ef7
    5 竞标

    ...subcat=Doorbusters And try to add 1 fish to cart. You will see the fish doesn't add, BUT then reload page, and you will see the fish in your cart. Error that is happening is: Uncaught DOMException: Failed to set the 'domain' property on 'Document': '[login to view URL]' is not a suffix of '[login to view URL]'. at [login to view U...

    $63 / hr (Avg Bid)
    $63 / hr \u5e73\u5747\u62a5\u4ef7
    7 竞标

    ...subcat=Doorbusters And try to add 1 fish to cart. You will see the fish doesn't add, BUT then reload page, and you will see the fish in your cart. Error that is happening is: Uncaught DOMException: Failed to set the 'domain' property on 'Document': '[login to view URL]' is not a suffix of '[login to view URL]'. at [login to view U...

    $63 / hr (Avg Bid)
    $63 / hr \u5e73\u5747\u62a5\u4ef7
    5 竞标

    I'm trying to install my theme and the required plug ins. However, this keeps failing because it says "Installation failed: Could not create directory" I need a professional who knows how to resolve this problem

    $181 (Avg Bid)
    $181 \u5e73\u5747\u62a5\u4ef7
    37 竞标

    i am having issue with my file manager on webmin HTTP/1.0 500 Perl execution failed Server: MiniServ/1.860 Date: Tue, 28 Nov 2017 17:47:32 GMT Content-type: text/html; Charset=iso-8859-1 Connection: close

    $181 (Avg Bid)
    $181 \u5e73\u5747\u62a5\u4ef7
    5 竞标